BDBM41401 7-methoxy-N-(2-methoxyethyl)-4,5-dihydrobenz[g]indoxazene-3-carboxamide::7-methoxy-N-(2-methoxyethyl)-4,5-dihydrobenzo[g][1,2]benzoxazole-3-carboxamide::7-methoxy-N-(2-methoxyethyl)-4,5-dihydronaphtho[2,1-d]isoxazole-3-carboxamide::MLS000087443::SMR000023666::cid_3239940
SMILES COCCNC(=O)c1noc-2c1CCc1cc(OC)ccc-21
InChI Key InChIKey=HOFPLBALDRUYDN-UHFFFAOYSA-N
Data  1 IC50
  Tab Delimited (TSV)   2D SDfile   Computed 3D by Vconf -m prep SDfile
Find this compound or compounds like it in BindingDB:
Activity Spreadsheet -- Enzyme Inhibition Constant Data from BindingDB
Found 1 hit for monomerid = 41401
TargetCathepsin G(Homo sapiens (Human))
Pcmd
Curated by PubChem BioAssay
LigandPNGBDBM41401(7-methoxy-N-(2-methoxyethyl)-4,5-dihydrobenz[g]ind...)
Affinity DataIC50:  4.36E+3nM. Assay description: Screening Center: Penn Center for Molecular Discovery Center Affiliation: University of Pennsylvania Network: Molecular Library Screening Center Netw...
In DepthDetails PCBioAssay